Reaction Details
TargetInhibitor of nuclear factor kappa-B kinase subunit beta
LigandBDBM312711
Substrate/Competitorn/a
Meas. Tech.NIK Enzyme Inhibition Assay
Ki 0.070±n/a nM
Citation Blaquiere, NCastanedo, GFeng, JAHu, BStaben, SYuen, PWu, GBurch, J Alkynyl alcohols and methods of use US Patent US9605005 Publication Date 3/28/2017
 
Inhibitor of nuclear factor kappa-B kinase subunit beta
Name:Inhibitor of nuclear factor kappa-B kinase subunit beta
Type:Serine/threonine-protein kinase
Mol. Mass.:86554.39
Organism:Homo sapiens (Human)
Description:GST-tagged IKK-2 was expressed in High Five cells and purified.
Residue:756
BDBM312711
NameBDBM312711
Synonyms:1-[3-[2-[(3R)-3-hydroxy-1- methyl-2-oxo-pyrrolidin-3- yl]ethynyl]phenyl]indazole- 3-carboxamide | US9605005, Example 1
TypeSmall organic molecule
Emp. Form.C21H18N4O3
Mol. Mass.374.3926
SMILESCN1CC[C@@](O)(C#Cc2cccc(c2)-n2nc(C(N)=O)c3ccccc23)C1=O