Reaction Details
TargetInhibitor of nuclear factor kappa-B kinase subunit beta
LigandBDBM312802
Substrate/Competitorn/a
Meas. Tech.NIK Enzyme Inhibition Assay
Ki 0.150±n/a nM
Citation Blaquiere, NCastanedo, GFeng, JAHu, BStaben, SYuen, PWu, GBurch, J Alkynyl alcohols and methods of use US Patent US9605005 Publication Date 3/28/2017
 
Inhibitor of nuclear factor kappa-B kinase subunit beta
Name:Inhibitor of nuclear factor kappa-B kinase subunit beta
Type:Serine/threonine-protein kinase
Mol. Mass.:86554.39
Organism:Homo sapiens (Human)
Description:GST-tagged IKK-2 was expressed in High Five cells and purified.
Residue:756
BDBM312802
NameBDBM312802
Synonyms:1-[3-[2-[(3R)-3-hydroxy-1- methyl-2-oxo-pyrrolidin-3- yl]ethynyl]phenyl]-7-(trifluoro- methyl)imidazo[1,5-a]pyri- dine-3-carboxamide | US9605005, Example 91
TypeSmall organic molecule
Emp. Form.C22H17F3N4O3
Mol. Mass.442.3906
SMILESCN1CC[C@@](O)(C#Cc2cccc(c2)-c2nc(C(N)=O)n3ccc(cc23)C(F)(F)F)C1=O