Reaction Details
TargetInhibitor of nuclear factor kappa-B kinase subunit beta
LigandBDBM312864
Substrate/Competitorn/a
Meas. Tech.NIK Enzyme Inhibition Assay
Ki 0.050±n/a nM
Citation Blaquiere, NCastanedo, GFeng, JAHu, BStaben, SYuen, PWu, GBurch, J Alkynyl alcohols and methods of use US Patent US9605005 Publication Date 3/28/2017
 
Inhibitor of nuclear factor kappa-B kinase subunit beta
Name:Inhibitor of nuclear factor kappa-B kinase subunit beta
Type:Serine/threonine-protein kinase
Mol. Mass.:86554.39
Organism:Homo sapiens (Human)
Description:GST-tagged IKK-2 was expressed in High Five cells and purified.
Residue:756
BDBM312864
NameBDBM312864
Synonyms:1-[3-[2-[(3R)-3-hydroxy-1- methyl-2-oxo-pyrrolidin-3- yl]ethynyl]phenyl]-6-methoxy- pyrazolo[3,4-b]pyridine- 3-carboxamide | US9605005, Example 154
TypeSmall organic molecule
Emp. Form.C21H19N5O4
Mol. Mass.405.4067
SMILESCOc1ccc2c(nn(-c3cccc(c3)C#C[C@]3(O)CCN(C)C3=O)c2n1)C(N)=O