Reaction Details
TargetBeta-secretase 1
LigandBDBM312923
Substrate/Competitorn/a
Meas. Tech.Pharmacological Assay
IC50 0.200±n/a nM
Citation Guba, WHaap, WKuglstatter, APeters, JSander, UOSchnider, CWermuth, RWoltering, T 5-aryl-1-imino-1-oxo-[1,2,4]thiadiazines US Patent US9605006 Publication Date 3/28/2017
 
Beta-secretase 1
Name:Beta-secretase 1
Type:Protein
Mol. Mass.:55755.10
Organism:Homo sapiens (Human)
Description:P56817
Residue:501
BDBM312923
NameBDBM312923
Synonyms:5-But-2-ynyloxy-pyrazine-2-carboxylic acid [3-((3R,4aS)-1-amino-3-methyl-4a-oxo-3,4,6,7,8,9-hexahydro-4aż6-thia-2,5,9a-triaza-benzocyclohepten-3-yl)-4-fluoro-phenyl]-amide | US9605006, 22
TypeSmall organic molecule
Emp. Form.C23H26FN7O3S
Mol. Mass.499.561
SMILESCC#CCOc1cnc(cn1)C(=O)Nc1ccc(F)c(c1)[C@]1(C)C[S@@]2(=O)=NCCCCN2C(N)=N1