Reaction Details
TargetcGMP-specific 3',5'-cyclic phosphodiesterase
LigandBDBM312960
Substrate/Competitorn/a
Meas. Tech.Inhibition Assay
IC50 0.250±n/a nM
Citation Vakalopoulos, AGromov, AFollmann, MBrockschnieder, DStasch, JMarquardt, TTersteegen, AWunder, FRedlich, GLang, DLi, VM Benzyl-1H-pyrazolo[3,4-b]pyridines and use thereof US Patent US9605008 Publication Date 3/28/2017
 
cGMP-specific 3',5'-cyclic phosphodiesterase
Name:cGMP-specific 3',5'-cyclic phosphodiesterase
Type:Protein
Mol. Mass.:99975.83
Organism:Homo sapiens (Human)
Description:O76074
Residue:875
BDBM312960
NameBDBM312960
Synonyms:3-[1-(2,3-Difluoro-4-methylbenzyl)-5-fluoro-6-methyl-1H-pyrazolo[3,4-b]pyridin-3-yl]-7,7-dimethyl-5,7-dihydro-6H-pyrrolo[2,3-e][1,2,4]triazin-6-one | US9605008, 19
TypeSmall organic molecule
Emp. Form.C22H18F3N7O
Mol. Mass.453.4198
SMILESCc1ccc(Cn2nc(-c3nnc4c(NC(=O)C4(C)C)n3)c3cc(F)c(C)nc23)c(F)c1F