Reaction Details
TargetProteinase-activated receptor 4
LigandBDBM175970
Substrate/Competitorn/a
Meas. Tech.FLIPR Assay
EC50 0.320±n/a nM
Citation Kornacker, MGMapelli, CRiexinger, DJ PAR4 agonist peptides US Patent US9605024 Publication Date 3/28/2017
 
Proteinase-activated receptor 4
Name:Proteinase-activated receptor 4
Type:Protein
Mol. Mass.:41145.16
Organism:Homo sapiens (Human)
Description:Q96RI0
Residue:385
BDBM175970
NameBDBM175970
Synonyms:US10047103, 3 US9688695, 3
TypeSmall organic molecule
Emp. Form.C24H18N4O4S2
Mol. Mass.490.554
SMILESCOc1nn2cc(nc2s1)-c1cc2c(OCc3csc(n3)-c3ccccc3)cc(OC)cc2o1