Reaction Details
TargetHigh affinity nerve growth factor receptor
LigandBDBM164901
Substrate/Competitorn/a
Meas. Tech.In Vitro TrkA Activity
IC50 0.300±n/a nM
Citation Kane, Jr., JLMatthews, GMetz, MKothe, MLiu, JScholte, A Tropomyosin-related kinase (Trk) inhibitors US Patent US10166239 Publication Date 1/1/2019
 
High affinity nerve growth factor receptor
Name:High affinity nerve growth factor receptor
Type:n/a
Mol. Mass.:87498.18
Organism:Homo sapiens (Human)
Description:P04629
Residue:796
BDBM164901
NameBDBM164901
Synonyms:US10166239, Ex. 3-15 US9067914, Ex. 3-15
TypeSmall organic molecule
Emp. Form.C26H26N6O3
Mol. Mass.470.523
SMILESCOc1ccc(COc2ccc(Cn3c(N)nc4cc(cnc34)-c3cnn(C)c3)cc2OC)cc1