Reaction Details
TargetMacrophage colony-stimulating factor 1 receptor
LigandBDBM164902
Substrate/Competitorn/a
Meas. Tech.In Vitro c-FMS Activity
IC50 2.00±n/a nM
Citation Kane, Jr., JLMatthews, GMetz, MKothe, MLiu, JScholte, A Tropomyosin-related kinase (Trk) inhibitors US Patent US10166239 Publication Date 1/1/2019
 
Macrophage colony-stimulating factor 1 receptor
Name:Macrophage colony-stimulating factor 1 receptor
Type:Protein
Mol. Mass.:107979.48
Organism:Homo sapiens (Human)
Description:P07333
Residue:972
BDBM164902
NameBDBM164902
Synonyms:US10166239, Ex. 3-16 US9067914, Ex. 3-16
TypeSmall organic molecule
Emp. Form.C29H30N5O4P
Mol. Mass.543.5534
SMILESCOc1ccc(COc2ccc(Cn3c(N)nc4cc(cnc34)-c3ccc(nc3)P(C)(C)=O)cc2OC)cc1