Reaction Details
TargetBDNF/NT-3 growth factors receptor
LigandBDBM164928
Substrate/Competitorn/a
Meas. Tech.In Vitro TrkB Activity
IC50 0.200±n/a nM
Citation Kane, Jr., JLMatthews, GMetz, MKothe, MLiu, JScholte, A Tropomyosin-related kinase (Trk) inhibitors US Patent US10166239 Publication Date 1/1/2019
 
BDNF/NT-3 growth factors receptor
Name:BDNF/NT-3 growth factors receptor
Type:Enzyme
Mol. Mass.:91996.87
Organism:Homo sapiens (Human)
Description:Q16620
Residue:822
BDBM164928
NameBDBM164928
Synonyms:US10166239, Ex. 3-35-2 US9067914, Ex. 3-35-2
TypeSmall organic molecule
Emp. Form.C25H22F3N7O2
Mol. Mass.509.4831
SMILESCOc1cc(Cn2c(N)nc3cc(cnc23)-c2cnn(C)c2)ccc1OCc1ccc(nc1)C(F)(F)F