Reaction Details
TargetBDNF/NT-3 growth factors receptor
LigandBDBM164945
Substrate/Competitorn/a
Meas. Tech.In Vitro TrkB Activity
IC50 0.200±n/a nM
Citation Kane, Jr., JLMatthews, GMetz, MKothe, MLiu, JScholte, A Tropomyosin-related kinase (Trk) inhibitors US Patent US10166239 Publication Date 1/1/2019
 
BDNF/NT-3 growth factors receptor
Name:BDNF/NT-3 growth factors receptor
Type:Enzyme
Mol. Mass.:91996.87
Organism:Homo sapiens (Human)
Description:Q16620
Residue:822
BDBM164945
NameBDBM164945
Synonyms:US10166239, Ex. 3-40-5 US9067914, Ex. 3-40-5
TypeSmall organic molecule
Emp. Form.C23H20F3N7O2S
Mol. Mass.515.511
SMILESCOc1cc(Cn2c(N)nc3cc(cnc23)-c2cnn(C)c2)ccc1OCc1csc(n1)C(F)(F)F