Reaction Details
TargetSphingosine-1-phosphate lyase 1
LigandBDBM313187
Substrate/Competitorn/a
Meas. Tech.S1P1 Binding Assay
IC50<10±n/a nM
Citation Dyckman, AJDhar, TGXiao, HGilmore, JLYang, MGXiao, ZMarcoux, D Substituted bicyclic compounds US Patent US10166249 Publication Date 1/1/2019
 
Sphingosine-1-phosphate lyase 1
Name:Sphingosine-1-phosphate lyase 1
Type:PROTEIN
Mol. Mass.:63546.76
Organism:Homo sapiens (Human)
Description:ChEMBL_108363
Residue:568
BDBM313187
NameBDBM313187
Synonyms:US10166249, Example 414 | US10166249, Example 415
TypeSmall organic molecule
Emp. Form.C19H30NO7P
Mol. Mass.415.4178
SMILESCCCCOC[C@@H]1COc2cc(ccc2O1)C1CCC(N)(COP(O)(O)=O)C1