Reaction Details
TargetSphingosine-1-phosphate lyase 1
LigandBDBM313207
Substrate/Competitorn/a
Meas. Tech.S1P1 Binding Assay
IC50<10±n/a nM
Citation Dyckman, AJDhar, TGXiao, HGilmore, JLYang, MGXiao, ZMarcoux, D Substituted bicyclic compounds US Patent US10166249 Publication Date 1/1/2019
 
Sphingosine-1-phosphate lyase 1
Name:Sphingosine-1-phosphate lyase 1
Type:PROTEIN
Mol. Mass.:63546.76
Organism:Homo sapiens (Human)
Description:ChEMBL_108363
Residue:568
BDBM313207
NameBDBM313207
Synonyms:US10166249, Example 436
TypeSmall organic molecule
Emp. Form.C20H32NO5P
Mol. Mass.397.4455
SMILESCCCCOC1CCc2cc(ccc2C1)[C@H]1CC[C@](N)(COP(O)(O)=O)C1