Reaction Details
TargetSphingosine-1-phosphate lyase 1
LigandBDBM65086
Substrate/Competitorn/a
Meas. Tech.S1P1 Binding Assay
IC50<10±n/a nM
Citation Dyckman, AJDhar, TGXiao, HGilmore, JLYang, MGXiao, ZMarcoux, D Substituted bicyclic compounds US Patent US10166249 Publication Date 1/1/2019
 
Sphingosine-1-phosphate lyase 1
Name:Sphingosine-1-phosphate lyase 1
Type:PROTEIN
Mol. Mass.:63546.76
Organism:Homo sapiens (Human)
Description:ChEMBL_108363
Residue:568
BDBM65086
NameBDBM65086
Synonyms:US10166249, Example 452 | US9522888, 452
Typen/a
Emp. Form.C21H32NO5P
Mol. Mass.409.4562
SMILESN[C@]1(COP(O)(O)=O)CC[C@@H](C1)c1ccc2C[C@H](COCCC=C)CCc2c1