Reaction Details
TargetSphingosine-1-phosphate lyase 1
LigandBDBM65147
Substrate/Competitorn/a
Meas. Tech.Receptor [35S] GTPgammaS Binding Assays: (S1P1 GTPgammaS/S1P3 GTPgammaS)
EC50<10±n/a nM
Citation Dyckman, AJDhar, TGXiao, HGilmore, JLYang, MGXiao, ZMarcoux, D Substituted bicyclic compounds US Patent US10166249 Publication Date 1/1/2019
 
Sphingosine-1-phosphate lyase 1
Name:Sphingosine-1-phosphate lyase 1
Type:PROTEIN
Mol. Mass.:63546.76
Organism:Homo sapiens (Human)
Description:ChEMBL_108363
Residue:568
BDBM65147
NameBDBM65147
Synonyms:US10166249, Example 501 | US9522888, 501
Typen/a
Emp. Form.C29H41N2O6P
Mol. Mass.544.6194
SMILESCCCCN(C)C(=O)c1cccc(OC[C@@H]2CCc3cc(ccc3C2)[C@H]2CC[C@](N)(COP(O)(O)=O)C2)c1