Reaction Details
TargetSphingosine-1-phosphate lyase 1
LigandBDBM313273
Substrate/Competitorn/a
Meas. Tech.Receptor [35S] GTPgammaS Binding Assays: (S1P1 GTPgammaS/S1P3 GTPgammaS)
EC50 5500±n/a nM
Citation Dyckman, AJDhar, TGXiao, HGilmore, JLYang, MGXiao, ZMarcoux, D Substituted bicyclic compounds US Patent US10166249 Publication Date 1/1/2019
 
Sphingosine-1-phosphate lyase 1
Name:Sphingosine-1-phosphate lyase 1
Type:PROTEIN
Mol. Mass.:63546.76
Organism:Homo sapiens (Human)
Description:ChEMBL_108363
Residue:568
BDBM313273
NameBDBM313273
Synonyms:US10166249, Example 507 | US10166249, Example 508
TypeSmall organic molecule
Emp. Form.C23H30NO4PS
Mol. Mass.447.527
SMILESN[C@]1(COP(O)(O)=O)CC[C@H](C1)c1ccc2CC(CSc3ccccc3)CCc2c1