Reaction Details
TargetSphingosine-1-phosphate lyase 1
LigandBDBM313348
Substrate/Competitorn/a
Meas. Tech.S1P1 Binding Assay
IC50<10±n/a nM
Citation Dyckman, AJDhar, TGXiao, HGilmore, JLYang, MGXiao, ZMarcoux, D Substituted bicyclic compounds US Patent US10166249 Publication Date 1/1/2019
 
Sphingosine-1-phosphate lyase 1
Name:Sphingosine-1-phosphate lyase 1
Type:PROTEIN
Mol. Mass.:63546.76
Organism:Homo sapiens (Human)
Description:ChEMBL_108363
Residue:568
BDBM313348
NameBDBM313348
Synonyms:US10166249, Example 582
TypeSmall organic molecule
Emp. Form.C24H32NO6P
Mol. Mass.461.4877
SMILESN[C@]1(COP(O)(O)=O)CC[C@@H](C1)c1ccc2C[C@@H](CCc2c1)OCCOc1ccccc1