Reaction Details
TargetSphingosine-1-phosphate lyase 1
LigandBDBM313371
Substrate/Competitorn/a
Meas. Tech.hS1P1 ERK Phosphorylation (S1P1 pERK)
EC50<10±n/a nM
Citation Dyckman, AJDhar, TGXiao, HGilmore, JLYang, MGXiao, ZMarcoux, D Substituted bicyclic compounds US Patent US10166249 Publication Date 1/1/2019
 
Sphingosine-1-phosphate lyase 1
Name:Sphingosine-1-phosphate lyase 1
Type:PROTEIN
Mol. Mass.:63546.76
Organism:Homo sapiens (Human)
Description:ChEMBL_108363
Residue:568
BDBM313371
NameBDBM313371
Synonyms:US10166249, Example 608
TypeSmall organic molecule
Emp. Form.C25H33FNO5P
Mol. Mass.477.5054
SMILESCOc1cc(CC[C@@H]2CCc3cc(ccc3C2)[C@H]2CC[C@](N)(COP(O)(O)=O)C2)ccc1F