Reaction Details
TargetSphingosine-1-phosphate lyase 1
LigandBDBM65306
Substrate/Competitorn/a
Meas. Tech.Receptor [35S] GTPgammaS Binding Assays: (S1P1 GTPgammaS/S1P3 GTPgammaS)
EC50<10±n/a nM
Citation Dyckman, AJDhar, TGXiao, HGilmore, JLYang, MGXiao, ZMarcoux, D Substituted bicyclic compounds US Patent US10166249 Publication Date 1/1/2019
 
Sphingosine-1-phosphate lyase 1
Name:Sphingosine-1-phosphate lyase 1
Type:PROTEIN
Mol. Mass.:63546.76
Organism:Homo sapiens (Human)
Description:ChEMBL_108363
Residue:568
BDBM65306
NameBDBM65306
Synonyms:US10166249, Example 623 | US9522888, 623
Typen/a
Emp. Form.C22H34NO6P
Mol. Mass.439.4822
SMILESCCCCCC(=O)OC1CCc2cc(ccc2C1)[C@H]1CC[C@](N)(COP(O)(O)=O)C1