Reaction Details
TargetSphingosine-1-phosphate lyase 1
LigandBDBM65316
Substrate/Competitorn/a
Meas. Tech.hS1P1 ERK Phosphorylation (S1P1 pERK)
EC50 5500±n/a nM
Citation Dyckman, AJDhar, TGXiao, HGilmore, JLYang, MGXiao, ZMarcoux, D Substituted bicyclic compounds US Patent US10166249 Publication Date 1/1/2019
 
Sphingosine-1-phosphate lyase 1
Name:Sphingosine-1-phosphate lyase 1
Type:PROTEIN
Mol. Mass.:63546.76
Organism:Homo sapiens (Human)
Description:ChEMBL_108363
Residue:568
BDBM65316
NameBDBM65316
Synonyms:US10166249, Example 633 | US9522888, 630
Typen/a
Emp. Form.C24H38NO5P
Mol. Mass.451.536
SMILESCCCCC1CCCC2(CCc3cc(ccc3C2)[C@H]2CC[C@](N)(COP(O)(O)=O)C2)O1