Reaction Details
TargetSphingosine 1-phosphate receptor 3
LigandBDBM65320
Substrate/Competitorn/a
Meas. Tech.Receptor [35S] GTPgammaS Binding Assays: (S1P1 GTPgammaS/S1P3 GTPgammaS)
EC50>625±n/a nM
Citation Dyckman, AJDhar, TGXiao, HGilmore, JLYang, MGXiao, ZMarcoux, D Substituted bicyclic compounds US Patent US10166249 Publication Date 1/1/2019
 
Sphingosine 1-phosphate receptor 3
Name:Sphingosine 1-phosphate receptor 3
Type:G Protein-Coupled Receptor (GPCR)
Mol. Mass.:42278.13
Organism:Homo sapiens (Human)
Description:Q99500
Residue:378
BDBM65320
NameBDBM65320
Synonyms:US10166249, Example 635 | US9522888, 635
Typen/a
Emp. Form.C20H30NO5P
Mol. Mass.395.4297
SMILESCCCCC1CCc2cc(ccc2C1=O)[C@H]1CC[C@](N)(COP(O)(O)=O)C1