Reaction Details
TargetTyrosine-protein kinase JAK1 [866-1154]
LigandBDBM264225
Substrate/Competitorn/a
Meas. Tech.Enzyme Inhibition Studies
IC50<3.00±n/a nM
Citation Astrand, AGrimster, NKawatkar, SKettle, JGNilsson, MKRuston, LSu, QVasbinder, MWinter-Holt, JJWoessner, RDChuaqui, CEMcCabe, J Compounds and methods for inhibiting JAK US Patent US10167276 Publication Date 1/1/2019
 
Tyrosine-protein kinase JAK1 [866-1154]
Name:Tyrosine-protein kinase JAK1 [866-1154]
Type:Protein
Mol. Mass.:33185.74
Organism:Homo sapiens (Human)
Description:P23458[866-1154]
Residue:289
BDBM264225
NameBDBM264225
Synonyms:(2R)-3-methoxy-N- (3-{2-[(3-methoxy- 1-methyl-1H-pyrazol- 4-yl)amino]-5- methylpyrimidin-4-yl}- 1H-indol-7-yl)- 2-(4-methylpiperazin-1- yl)propanamide US10654835, Example 45 US9714236, 45
TypeSmall organic molecule
Emp. Form.C27H35N9O3
Mol. Mass.533.6253
SMILESCOC[C@@H](N1CCN(C)CC1)C(=O)Nc1cccc2c(c[nH]c12)-c1nc(Nc2cn(C)nc2OC)ncc1C