Reaction Details
TargetSerine/threonine-protein kinase B-raf [416-766,V600E]
LigandBDBM313464
Substrate/Competitorn/a
Meas. Tech.In Vitro Raf Activity Determination
IC50 59.3±n/a nM
Citation Aversa, RJBurger, MTDillon, MPDineen, Jr., TALou, YNishiguchi, GARamurthy, SRico, ACRauniyar, VSendzik, MSubramanian, SSetti, LQTaft, BRTanner, HRWan, L Compounds and compositions as RAF kinase inhibitors US Patent US10167279 Publication Date 1/1/2019
 
Serine/threonine-protein kinase B-raf [416-766,V600E]
Name:Serine/threonine-protein kinase B-raf [416-766,V600E]
Type:n/a
Mol. Mass.:39690.71
Organism:Homo sapiens (Human)
Description:PV3849, from Invitrogen
Residue:351
BDBM313464
NameBDBM313464
Synonyms:N-(5'-(3-fluorooxetan-3- yl)-6'-methoxy-2- methyl-[3,3'-bipyridin]- 5-yl)-4- (trifluoromethyl)picolin- amide | US10167279, Example 83
TypeSmall organic molecule
Emp. Form.C22H18F4N4O3
Mol. Mass.462.3969
SMILESCOc1ncc(cc1C1(F)COC1)-c1cc(NC(=O)c2cc(ccn2)C(F)(F)F)cnc1C