Reaction Details
TargetRAF proto-oncogene serine/threonine-protein kinase
LigandBDBM313571
Substrate/Competitorn/a
Meas. Tech.In Vitro Raf Activity Determination
IC50 30.0±n/a nM
Citation Aversa, RJBurger, MTDillon, MPDineen, Jr., TALou, YNishiguchi, GARamurthy, SRico, ACRauniyar, VSendzik, MSubramanian, SSetti, LQTaft, BRTanner, HRWan, L Compounds and compositions as RAF kinase inhibitors US Patent US10167279 Publication Date 1/1/2019
 
RAF proto-oncogene serine/threonine-protein kinase
Name:RAF proto-oncogene serine/threonine-protein kinase
Type:Serine/threonine-protein kinase
Mol. Mass.:73082.52
Organism:Homo sapiens (Human)
Description:P04049
Residue:648
BDBM313571
NameBDBM313571
Synonyms:N-(3-(2- (hydroxymethyl)- 2-methyl-3-oxo-5- (tetrahydro-2H-pyran-4- yl)-3,4-dihydro-2H-benzo [b][1,4]oxazin-7-yl)-4- methylphenyl)-5- (trifluoromethyl) pyridazine-3-carboxamide | US10167279, Example 195
TypeSmall organic molecule
Emp. Form.C28H27F3N4O5
Mol. Mass.556.533
SMILESCc1ccc(NC(=O)c2cc(cnn2)C(F)(F)F)cc1-c1cc2OC(C)(CO)C(=O)Nc2c(c1)C1CCOCC1