Reaction Details
TargetRAF proto-oncogene serine/threonine-protein kinase
LigandBDBM313655
Substrate/Competitorn/a
Meas. Tech.In Vitro Raf Activity Determination
IC50 50.0±n/a nM
Citation Aversa, RJBurger, MTDillon, MPDineen, Jr., TALou, YNishiguchi, GARamurthy, SRico, ACRauniyar, VSendzik, MSubramanian, SSetti, LQTaft, BRTanner, HRWan, L Compounds and compositions as RAF kinase inhibitors US Patent US10167279 Publication Date 1/1/2019
 
RAF proto-oncogene serine/threonine-protein kinase
Name:RAF proto-oncogene serine/threonine-protein kinase
Type:Serine/threonine-protein kinase
Mol. Mass.:73082.52
Organism:Homo sapiens (Human)
Description:P04049
Residue:648
BDBM313655
NameBDBM313655
Synonyms:(R)-N-(3-(2-(2,3- dihydroxypropoxy)-6- (tetrahydro-2H-pyran-4- yl)pyridin-4-yl)-4- methylphenyl)-5- (trifluoromethyl) nicotinamide | US10167279, Example 281
TypeSmall organic molecule
Emp. Form.C27H28F3N3O5
Mol. Mass.531.5235
SMILESCc1ccc(NC(=O)c2cncc(c2)C(F)(F)F)cc1-c1cc(OC[C@H](O)CO)nc(c1)C1CCOCC1