Reaction Details
TargetHeat shock protein HSP 90-alpha
LigandBDBM313757
Substrate/Competitorn/a
Meas. Tech.Biological Testing
EC50 8500±100 nM
Citation Chiosis, GHe, HLlauger-Bufi, LKim, JLarson, SMSmith-Jones, P Small-molecule HSP90 inhibitors US Patent US10167285 Publication Date 1/1/2019
 
Heat shock protein HSP 90-alpha
Name:Heat shock protein HSP 90-alpha
Type:Molecular Chaperone
Mol. Mass.:84623.45
Organism:Homo sapiens (Human)
Description:P07900
Residue:732
BDBM313757
NameBDBM313757
Synonyms:US10167285, Example 2
TypeSmall organic molecule
Emp. Form.C16H13Cl3N4S
Mol. Mass.399.725
SMILESClc1ccc(Cl)c(SC2Nc3cncnc3N2CCCC#C)c1Cl