Reaction Details
TargetHeat shock protein HSP 90-alpha
LigandBDBM313759
Substrate/Competitorn/a
Meas. Tech.Biological Testing
EC50 15400±2200 nM
Citation Chiosis, GHe, HLlauger-Bufi, LKim, JLarson, SMSmith-Jones, P Small-molecule HSP90 inhibitors US Patent US10167285 Publication Date 1/1/2019
 
Heat shock protein HSP 90-alpha
Name:Heat shock protein HSP 90-alpha
Type:Molecular Chaperone
Mol. Mass.:84623.45
Organism:Homo sapiens (Human)
Description:P07900
Residue:732
BDBM313759
NameBDBM313759
Synonyms:US10167285, Example 4
TypeSmall organic molecule
Emp. Form.C11H7BrCl2N4S
Mol. Mass.378.075
SMILESClc1ccc(Br)c(SC2Nc3cncnc3N2)c1Cl