Reaction Details
TargetHeat shock protein HSP 90-alpha
LigandBDBM313768
Substrate/Competitorn/a
Meas. Tech.Biological Testing
EC50>15000±n/a nM
Citation Chiosis, GHe, HLlauger-Bufi, LKim, JLarson, SMSmith-Jones, P Small-molecule HSP90 inhibitors US Patent US10167285 Publication Date 1/1/2019
 
Heat shock protein HSP 90-alpha
Name:Heat shock protein HSP 90-alpha
Type:Molecular Chaperone
Mol. Mass.:84623.45
Organism:Homo sapiens (Human)
Description:P07900
Residue:732
BDBM313768
NameBDBM313768
Synonyms:US10167285, Example 13
TypeSmall organic molecule
Emp. Form.C18H18BrFN4O2S
Mol. Mass.453.329
SMILESCOc1ccc(Br)c(SC2Nc3cnc(F)nc3N2CCCC#C)c1OC