Reaction Details
TargetHeat shock protein HSP 90-alpha
LigandBDBM313770
Substrate/Competitorn/a
Meas. Tech.Biological Testing
EC50 120±300 nM
Citation Chiosis, GHe, HLlauger-Bufi, LKim, JLarson, SMSmith-Jones, P Small-molecule HSP90 inhibitors US Patent US10167285 Publication Date 1/1/2019
 
Heat shock protein HSP 90-alpha
Name:Heat shock protein HSP 90-alpha
Type:Molecular Chaperone
Mol. Mass.:84623.45
Organism:Homo sapiens (Human)
Description:P07900
Residue:732
BDBM313770
NameBDBM313770
Synonyms:US10167285, Comp 2
TypeSmall organic molecule
Emp. Form.C19H20ClFN4O3S
Mol. Mass.438.904
SMILESCOc1cc(Cl)c(SC2Nc3cnc(F)nc3N2CCCC#C)c(OC)c1OC