Reaction Details
TargetCaspase-3
LigandBDBM160781
Substrate/Competitorn/a
Meas. Tech. In Vitro Inhibitory Activity of Caspase
IC50 10.00±n/a nM
Citation Ahlfors, JMekouar, K Selective caspase inhibitors and uses thereof US Patent US10167313 Publication Date 1/1/2019
 
Caspase-3
Name:Caspase-3
Type:Hydrolase; heterotetramer of two heterodimers
Mol. Mass.:31607.55
Organism:Homo sapiens (Human)
Description:n/a
Residue:277
BDBM160781
NameBDBM160781
Synonyms:US10167313, Compound 48 | US9045524, 48
TypeSmall organic molecule
Emp. Form.C35H40ClN5O11S
Mol. Mass.774.237
SMILESCC(C)[C@H](NC(=O)[C@H](Cc1ccc2ccccc2n1)NC(=O)[C@H](CC(O)=O)NC(=O)OCc1ccccc1)C(=O)N[C@@H](CC(O)=O)\C=C(/Cl)S(C)(=O)=O