Reaction Details
TargetIntegrin alpha-4/beta-7
LigandBDBM314075
Substrate/Competitorn/a
Meas. Tech.ELISA assay
IC50 1.64±n/a nM
Citation Vinnik, AFedichev, PKholin, MMolloy, CKatz, AKadushkin, A Compounds for the treatment and prevention of retroviral infections US Patent US9610264 Publication Date 4/4/2017
 
Integrin alpha-4/beta-7
Name:Integrin alpha-4/beta-7
Type:Protein Complex
Mol. Mass.:n/a
Description:The assay uses stably transfected K562 cells expressing human alpha4beta7 integrin.
Components:This complex has 2 components.
Component 1
Name:Integrin alpha-4
Synonyms:CD49 antigen-like family member D CD49d antigen ITA4_HUMAN Integrin alpha-4 Integrin alpha-IV VLA-4 integrin alpha 4 precursor | integrin alpha-4 precursor
Type:Membrane Protein
Mol. Mass.:114897.35
Organism:Homo sapiens (Human)
Description:P13612
Residue:1032
Component 2
Name:Integrin beta-7
Synonyms:ITB7_HUMAN Integrin alpha-4/beta-7 Integrin beta7
Type:Membrane Protein
Mol. Mass.:86893.88
Organism:Homo sapiens (Human)
Description:P26010
Residue:798
BDBM314075
NameBDBM314075
Synonyms:US9610264, Compound 10
TypeSmall organic molecule
Emp. Form.C21H17N3O4
Mol. Mass.375.3774
SMILESO=C(NCc1ccccc1)c1ccccc1NC(=O)c1cccc(c1)N(=O)=O