Reaction Details
TargetAcetylcholinesterase
LigandBDBM9047
Substrate/CompetitorBDBM8959
Meas. Tech.Enzyme Inhibition Assay
pH7.4±n/a
Temperature310.15±n/a K
IC50 3.8±0.4 nM
Citation Carlier, PRHan, YFChow, ESLi, CPWang, HLieu, TXWong, HSPang, YP Evaluation of short-tether bis-THA AChE inhibitors. A further test of the dual binding site hypothesis. Bioorg Med Chem7:351-7 (1999) 
 
Acetylcholinesterase
Name:Acetylcholinesterase
Type:Enzyme
Mol. Mass.:68193.62
Organism:Rattus norvegicus (rat)
Description:P37136
Residue:614
BDBM9047
BDBM8959
NameBDBM9047
Synonyms:Bis-THA inhibitor 5 Hexylene-Linked Bis-tacrine N-[6-(1,2,3,4-tetrahydroacridin-9-ylamino)hexyl]-1,2,3,4-tetrahydroacridin-9-amine
TypeSmall organic molecule
Emp. Form.C32H38N4
Mol. Mass.478.6709
SMILESC(CCCNc1c2CCCCc2nc2ccccc12)CCNc1c2CCCCc2nc2ccccc12