Reaction Details
TargetcAMP and cAMP-inhibited cGMP 3',5'-cyclic phosphodiesterase 10A [440-779]
LigandBDBM164395
Substrate/Competitorn/a
Meas. Tech.PDE10A Inhibition Assay
Temperature298.15±n/a K
IC50 0.33±n/a nM
Commentsextracted
Citation Püschl, ANielsen, JKehler, JKilburn, JPMarigo, MLanggård, M Heteroaromatic phenylimidazole derivatives as PDE10A enzyme inhibitors US Patent US9669029 Publication Date 6/6/2017
 
cAMP and cAMP-inhibited cGMP 3',5'-cyclic phosphodiesterase 10A [440-779]
Name:cAMP and cAMP-inhibited cGMP 3',5'-cyclic phosphodiesterase 10A [440-779]
Type:n/a
Mol. Mass.:39060.01
Organism:Homo sapiens (Human)
Description:Q9Y233[440-779]
Residue:340
BDBM164395
NameBDBM164395
Synonyms:US9669029, 98 8-Methoxy-5-methyl-2-{2-[1-(2-morpholin-4-yl-ethyl)-4-thiophen-2-yl-1H-imidazol-2-yl]-ethyl}-[1,2,4]triazolo[1,5-a]pyridine
TypeSmall organic molecule
Emp. Form.C23H30N6O2S
Mol. Mass.454.588
SMILESCOC1=CC=C(C)N2N=C(CCc3nc(cn3CCN3CCOCC3)-c3cccs3)NC12