Reaction Details
TargetAcetylcholinesterase
LigandBDBM10490
Substrate/CompetitorBDBM8959
Meas. Tech.Enzyme Inhibition Assay
pH7.8±n/a
Temperature295.15±n/a K
IC50 36±n/a nM
Citation Doucet-Personeni, CBentley, PDFletcher, RJKinkaid, AKryger, GPirard, BTaylor, ATaylor, RTaylor, JViner, RSilman, ISussman, JLGreenblatt, HMLewis, T A structure-based design approach to the development of novel, reversible AChE inhibitors. J Med Chem44:3203-15 (2001) 
 
Acetylcholinesterase
Name:Acetylcholinesterase
Type:n/a
Mol. Mass.:65900.74
Organism:Tetronarce californica (Pacific electric ray) (Torpedo californica)
Description:P04058
Residue:586
BDBM10490
BDBM8959
NameBDBM10490
Synonyms:7-({1-chloro-6H,7H,8H,9H,10H-cyclohepta[b]quinolin-11-yl}amino)-1,1,1-trifluoroheptane-2,2-diol N-Alkylated Tacrine Analogue 6a
TypeSmall organic molecule
Emp. Form.C21H26ClF3N2O2
Mol. Mass.430.892
SMILESOC(O)(CCCCCNc1c2CCCCCc2nc2cccc(Cl)c12)C(F)(F)F