Reaction Details
TargetCholinesterase
LigandBDBM10507
Substrate/CompetitorBDBM8978
Meas. Tech.Enzyme Inhibition Assay
pH8±n/a
Temperature310.15±n/a K
IC50 12.0±0.6 nM
Citation Rosini, MAndrisano, VBartolini, MBolognesi, MLHrelia, PMinarini, ATarozzi, AMelchiorre, C Rational approach to discover multipotent anti-Alzheimer drugs. J Med Chem48:360-3 (2005) 
 
Cholinesterase
Name:Cholinesterase
Type:Homotetramer
Mol. Mass.:68422.27
Organism:Homo sapiens (Human)
Description:P06276
Residue:602
BDBM10507
BDBM8978
NameBDBM10507
Synonyms:5-(1,2-dithiolan-3-yl)-N-[3-(1,2,3,4-tetrahydroacridin-9-ylamino)propyl]pentanamide | tacrine-lipoic acid hybrid 2
TypeSmall organic molecule
Emp. Form.C24H33N3OS2
Mol. Mass.443.668
SMILESO=C(CCCCC1CCSS1)NCCCNc1c2CCCCc2nc2ccccc12