Reaction Details
TargetCholinesterase
LigandBDBM10512
Substrate/CompetitorBDBM8978
Meas. Tech.Enzyme Inhibition Assay
pH8±n/a
Temperature310.15±n/a K
IC50 10.8±2.5 nM
Citation Rosini, MAndrisano, VBartolini, MBolognesi, MLHrelia, PMinarini, ATarozzi, AMelchiorre, C Rational approach to discover multipotent anti-Alzheimer drugs. J Med Chem48:360-3 (2005) 
 
Cholinesterase
Name:Cholinesterase
Type:Homotetramer
Mol. Mass.:68422.27
Organism:Homo sapiens (Human)
Description:P06276
Residue:602
BDBM10512
BDBM8978
NameBDBM10512
Synonyms:CHEMBL194823 tacrine-lipoic acid hybrid 7
TypeSmall organic molecule
Emp. Form.C24H32ClN3OS2
Mol. Mass.478.113
SMILESClc1ccc2c(NCCCNC(=O)CCCCC3CCSS3)c3CCCCc3nc2c1