Reaction Details
TargetCarboxylic ester hydrolase
LigandBDBM10519
Substrate/CompetitorBDBM8978
Meas. Tech.Measurement of FBSAChE/EqBuChE Inhibitory Activity
pH8±n/a
Temperature298.15±n/a K
Ki 180±n/a nM
Citation Savini, LCampiani, GGaeta, APellerano, CFattorusso, CChiasserini, LFedorko, JMSaxena, A Novel and potent tacrine-related hetero- and homobivalent ligands for acetylcholinesterase and butyrylcholinesterase. Bioorg Med Chem Lett11:1779-82 (2001) 
 
Carboxylic ester hydrolase
Name:Carboxylic ester hydrolase
Type:Protein
Mol. Mass.:68842.83
Organism:Equus caballus (Horse)
Description:Q9N1N9
Residue:602
BDBM10519
BDBM8978
NameBDBM10519
Synonyms:CHEMBL51350 tacrine heterobivalent compound 3c
TypeSmall organic molecule
Emp. Form.C33H38Cl2N4
Mol. Mass.561.588
SMILESClc1cc(Cl)c2c(NCCCCCCCNc3c4CCCCc4nc4ccccc34)c3CCCCc3nc2c1