Reaction Details
TargetCarboxylic ester hydrolase
LigandBDBM10524
Substrate/CompetitorBDBM8978
Meas. Tech.Measurement of FBSAChE/EqBuChE Inhibitory Activity
pH8±n/a
Temperature298.15±n/a K
Ki 45±n/a nM
Citation Savini, LCampiani, GGaeta, APellerano, CFattorusso, CChiasserini, LFedorko, JMSaxena, A Novel and potent tacrine-related hetero- and homobivalent ligands for acetylcholinesterase and butyrylcholinesterase. Bioorg Med Chem Lett11:1779-82 (2001) 
 
Carboxylic ester hydrolase
Name:Carboxylic ester hydrolase
Type:Protein
Mol. Mass.:68842.83
Organism:Equus caballus (Horse)
Description:Q9N1N9
Residue:602
BDBM10524
BDBM8978
NameBDBM10524
Synonyms:N-{6-[(6,8-dichloro-1,2,3,4-tetrahydroacridin-9-yl)sulfanyl]hexyl}-1,2,3,4-tetrahydroacridin-9-amine | tacrine heterobivalent compound 3h
TypeSmall organic molecule
Emp. Form.C32H35Cl2N3S
Mol. Mass.564.611
SMILESClc1cc(Cl)c2c(SCCCCCCNc3c4CCCCc4nc4ccccc34)c3CCCCc3nc2c1