Reaction Details
TargetMAP kinase-interacting serine/threonine-protein kinase 2
LigandBDBM168222
Substrate/Competitorn/a
Meas. Tech.Mnk Biochemical Enzymatic Assay
Temperature298.15±n/a K
IC50<10.00±n/a nM
Commentsextracted
Citation Reich, SHSprengeler, PAWebber, SEXiang, AXErnst, JT MNK inhibitors and methods related thereto US Patent US9669031 Publication Date 6/6/2017
 
MAP kinase-interacting serine/threonine-protein kinase 2
Name:MAP kinase-interacting serine/threonine-protein kinase 2
Type:Protein
Mol. Mass.:51870.79
Organism:Homo sapiens (Human)
Description:Q9HBH9
Residue:465
BDBM168222
NameBDBM168222
Synonyms:US9669031, 51 N-[6-[[8-chloro-3-(3-chlorophenyl)-3-methyl-1,5-dioxo-2H-imidazo[1,5-a]pyridin-6-yl]amino]pyrimidin-4-yl]cyclopropanecarboxamide (Cpd. No. 51) | US9669031, 93 6-[(6-aminopyrimidin-4-yl)amino]-8-chloro-3-(3-chlorophenyl)-3-methyl-2H-imidazo[1,5-a]pyridine-1,5-dione (Cpd. No. 93)
TypeSmall organic molecule
Emp. Form.C22H18Cl2N6O3
Mol. Mass.485.323
SMILESCC1(NC(=O)c2c(Cl)cc(Nc3cc(NC(=O)C4CC4)ncn3)c(=O)n12)c1cccc(Cl)c1