Reaction Details
TargetMAP kinase-interacting serine/threonine-protein kinase 2
LigandBDBM168305
Substrate/Competitorn/a
Meas. Tech.Mnk Biochemical Enzymatic Assay
Temperature298.15±n/a K
IC50<10.00±n/a nM
Commentsextracted
Citation Reich, SHSprengeler, PAWebber, SEXiang, AXErnst, JT MNK inhibitors and methods related thereto US Patent US9669031 Publication Date 6/6/2017
 
MAP kinase-interacting serine/threonine-protein kinase 2
Name:MAP kinase-interacting serine/threonine-protein kinase 2
Type:Protein
Mol. Mass.:51870.79
Organism:Homo sapiens (Human)
Description:Q9HBH9
Residue:465
BDBM168305
NameBDBM168305
Synonyms:US9669031, 131 6′-(pyrimidin-4-ylamino)-1′-thioxo-1′,2′-dihydro-5′H-spiro[cyclohexane-1,3′-imidazo[1,5-a]pyridin]-5′-one (Cpd. No. 131)
TypeSmall organic molecule
Emp. Form.C16H17N5OS
Mol. Mass.327.404
SMILESO=c1c(Nc2ccncn2)ccc2C(=S)NC3(CCCCC3)n12