Reaction Details
TargetMAP kinase-interacting serine/threonine-protein kinase 2
LigandBDBM168321
Substrate/Competitorn/a
Meas. Tech.Mnk Biochemical Enzymatic Assay
Temperature298.15±n/a K
IC50<10.00±n/a nM
Commentsextracted
Citation Reich, SHSprengeler, PAWebber, SEXiang, AXErnst, JT MNK inhibitors and methods related thereto US Patent US9669031 Publication Date 6/6/2017
 
MAP kinase-interacting serine/threonine-protein kinase 2
Name:MAP kinase-interacting serine/threonine-protein kinase 2
Type:Protein
Mol. Mass.:51870.79
Organism:Homo sapiens (Human)
Description:Q9HBH9
Residue:465
BDBM168321
NameBDBM168321
Synonyms:US9669031, 157 8-chloro-6-(pyrimidin-4-ylamino)-1′-(2,2,2-trifluoroethyl)-2H-spiro[imidazo[1,5-a]pyridine-3,4′-piperidine]-1,5-dione (Cpd. No. 157)
TypeSmall organic molecule
Emp. Form.C17H16ClF3N6O2
Mol. Mass.428.796
SMILESFC(F)(F)CN1CCC2(CC1)NC(=O)c1c(Cl)cc(Nc3ccncn3)c(=O)n21