Reaction Details
TargetMAP kinase-interacting serine/threonine-protein kinase 1
LigandBDBM168335
Substrate/Competitorn/a
Meas. Tech.Mnk Biochemical Enzymatic Assay
Temperature298.15±n/a K
IC50<10.00±n/a nM
Commentsextracted
Citation Reich, SHSprengeler, PAWebber, SEXiang, AXErnst, JT MNK inhibitors and methods related thereto US Patent US9669031 Publication Date 6/6/2017
 
MAP kinase-interacting serine/threonine-protein kinase 1
Name:MAP kinase-interacting serine/threonine-protein kinase 1
Type:Serine/threonine-protein kinase
Mol. Mass.:51342.85
Organism:Homo sapiens (Human)
Description:Q9BUB5
Residue:465
BDBM168335
NameBDBM168335
Synonyms:US9669031, 170 6-[(6-aminopyrimidin-4-yl)amino]-1′,8-dimethyl-spiro[2H-imidazo[1,5-a]pyridine-3,3′-piperidine]-1,5-dione (Cpd. No. 170)
TypeSmall organic molecule
Emp. Form.C22H29N7O4
Mol. Mass.455.5102
SMILESCN1CCCC2(C1)NC(=O)c1c(C)cc(Nc3cc(NC(=O)OC(C)(C)C)ncn3)c(=O)n21