Reaction Details
TargetMAP kinase-interacting serine/threonine-protein kinase 2
LigandBDBM168214
Substrate/Competitorn/a
Meas. Tech.Mnk Biochemical Enzymatic Assay
Temperature298.15±n/a K
IC50<10.00±n/a nM
Commentsextracted
Citation Reich, SHSprengeler, PAWebber, SEXiang, AXErnst, JT MNK inhibitors and methods related thereto US Patent US9669031 Publication Date 6/6/2017
 
MAP kinase-interacting serine/threonine-protein kinase 2
Name:MAP kinase-interacting serine/threonine-protein kinase 2
Type:Protein
Mol. Mass.:51870.79
Organism:Homo sapiens (Human)
Description:Q9HBH9
Residue:465
BDBM168214
NameBDBM168214
Synonyms:US9669031, 207 6′-((6-aminopyrimidin-4-yl)amino)-8′-(hydroxymethyl)-2′H-spiro[cyclohexane-1,3′-imidazo[1,5-a]pyridine]-1′,5′-dione (Cpd. No. 207) | US9669031, 45 N-(6-((8′-chloro-1′,5′-dioxo-1′,5′-dihydro-2′H-spiro[cyclohexane-1,3′-imidazo[1,5-a]pyridin]-6′-yl)amino)pyrimidin-4-yl)cyclopropanecarboxamide (Cpd. No. 45)
TypeSmall organic molecule
Emp. Form.C20H21ClN6O3
Mol. Mass.428.872
SMILESClc1cc(Nc2cc(NC(=O)C3CC3)ncn2)c(=O)n2c1C(=O)NC21CCCCC1