Reaction Details
TargetMAP kinase-interacting serine/threonine-protein kinase 2
LigandBDBM168370
Substrate/Competitorn/a
Meas. Tech.Mnk Biochemical Enzymatic Assay
Temperature298.15±n/a K
IC50<10.00±n/a nM
Commentsextracted
Citation Reich, SHSprengeler, PAWebber, SEXiang, AXErnst, JT MNK inhibitors and methods related thereto US Patent US9669031 Publication Date 6/6/2017
 
MAP kinase-interacting serine/threonine-protein kinase 2
Name:MAP kinase-interacting serine/threonine-protein kinase 2
Type:Protein
Mol. Mass.:51870.79
Organism:Homo sapiens (Human)
Description:Q9HBH9
Residue:465
BDBM168370
NameBDBM168370
Synonyms:US9669031, 223 6′-((6-amino-5-chloropyrimidin-4-yl)amino)-8′-methyl-2′H-spiro[cyclohexane-1,3′-imidazo[1,5-a]pyridine]-1′,5′-dione hydrochloride (Cpd. No. 223)
TypeSmall organic molecule
Emp. Form.C17H19ClN6O2
Mol. Mass.374.825
SMILESCc1cc(Nc2ncnc(N)c2Cl)c(=O)n2c1C(=O)NC21CCCCC1