Reaction Details
TargetIntermediate conductance calcium-activated potassium channel protein 4
LigandBDBM314285
Substrate/Competitorn/a
Meas. Tech.Electrophysiology Assay
IC50 15.0±n/a nM
Citation Green, LWang, H Oxazolidinone and imidazolidinone compounds US Patent US9611232 Publication Date 4/4/2017
 
Intermediate conductance calcium-activated potassium channel protein 4
Name:Intermediate conductance calcium-activated potassium channel protein 4
Type:PROTEIN
Mol. Mass.:47723.22
Organism:Homo sapiens (Human)
Description:ChEMBL_1361891
Residue:427
BDBM314285
NameBDBM314285
Synonyms:US9611232, Example 17
TypeSmall organic molecule
Emp. Form.C23H19FN2O3
Mol. Mass.390.407
SMILESNC(=O)CN1[C@@H](c2ccccc2F)C(OC1=O)(c1ccccc1)c1ccccc1