Reaction Details
TargetAcetylcholinesterase
LigandBDBM10597
Substrate/CompetitorBDBM8959
Meas. Tech.Enzyme Inhibition Assay
pH8±n/a
Temperature298.15±n/a K
Ki 0.026±n/a nM
Citation Gemma, SGabellieri, EHuleatt, PFattorusso, CBorriello, MCatalanotti, BButini, SDe Angelis, MNovellino, ENacci, VBelinskaya, TSaxena, ACampiani, G Discovery of huperzine A-tacrine hybrids as potent inhibitors of human cholinesterases targeting their midgorge recognition sites. J Med Chem49:3421-5 (2006) 
 
Acetylcholinesterase
Name:Acetylcholinesterase
Type:Enzyme
Mol. Mass.:67792.70
Organism:Homo sapiens (Human)
Description:P22303
Residue:614
BDBM10597
BDBM8959
NameBDBM10597
Synonyms:(1S)-7-chloro-15-ethyl-10-azatetracyclo[11.3.1.0^{2,11}.0^{4,9}]heptadeca-2(11),3,5,7,9,14-hexaen-3-amine CHEMBL143812 rac-huprine H7
TypeSmall organic molecule
Emp. Form.C18H19ClN2
Mol. Mass.298.81
SMILESCCC1=CC2CC(C1)c1c(C2)nc2cc(Cl)ccc2c1N