Reaction Details
TargetCholinesterase
LigandBDBM10441
Substrate/CompetitorBDBM8978
Meas. Tech.Enzyme Inhibition Assay
pH8±n/a
Temperature298.15±n/a K
Ki>1000±n/a nM
Citation Gemma, SGabellieri, EHuleatt, PFattorusso, CBorriello, MCatalanotti, BButini, SDe Angelis, MNovellino, ENacci, VBelinskaya, TSaxena, ACampiani, G Discovery of huperzine A-tacrine hybrids as potent inhibitors of human cholinesterases targeting their midgorge recognition sites. J Med Chem49:3421-5 (2006) 
 
Cholinesterase
Name:Cholinesterase
Type:Homotetramer
Mol. Mass.:68422.27
Organism:Homo sapiens (Human)
Description:P06276
Residue:602
BDBM10441
BDBM8978
NameBDBM10441
Synonyms:(+)-Huperzine A (-)-Huperzine A (1R,13E)-1-amino-13-ethylidene-11-methyl-6-azatricyclo[7.3.1.0^{2,7}]trideca-2(7),3,10-trien-5-one (5S,11E)-5-amino-11-ethylidene-7-methyl-5,6,9,10-tetrahydro-5,9-methanocycloocta[b]pyridin-2(1H)-one | Huperzine A
TypeSmall organic molecule
Emp. Form.C15H18N2O
Mol. Mass.242.3162
SMILESC\C=C1/C2Cc3[nH]c(=O)ccc3C1(N)CC(C)=C2