Reaction Details
TargetCyclin-T1/Cyclin-dependent kinase 9
LigandBDBM170515
Substrate/Competitorn/a
Meas. Tech.CDK9/CycT1 Kinase Assay
pH8±n/a
Temperature295.15±n/a K
IC50 2.00±n/a nM
Commentsextracted
Citation Lücking, UBohlmann, RScholz, ASiemeister, GGnoth, MJBömer, UKosemund, DLienau, PRühter, GSchultz-Fademrecht, C 4-aryl-N-phenyl-1,3,5-triazin-2-amines containing a sulfoximine group US Patent US9669034 Publication Date 6/6/2017
 
Cyclin-T1/Cyclin-dependent kinase 9
Name:Cyclin-T1/Cyclin-dependent kinase 9
Type:Protein Complex
Mol. Mass.:n/a
Description:n/a
Components:This complex has 2 components.
Component 1
Name:Cyclin-T1
Synonyms:CCNT1 CycT Cyclin T Cyclin-T
Type:Enzyme Subunit
Mol. Mass.:80712.40
Organism:Homo sapiens (Human)
Description:n/a
Residue:726
Component 2
Name:Cyclin-dependent kinase 9
Synonyms:C-2K CDK9 Cell division cycle 2-like protein kinase 4 Cyclin-Dependent Kinase 9 (CDK9) Serine/threonine-protein kinase PITALRE Tat-associated kinase complex catalytic subunit
Type:Enzyme Subunit
Mol. Mass.:42789.13
Organism:Homo sapiens (Human)
Description:n/a
Residue:372
BDBM170515
NameBDBM170515
Synonyms:US9669034, 90 (rac)-4-{4-Fluoro-2-[(3-fluorobenzyl)oxy]phenyl}-N-{3-[(S-methylsulfonimidoyl)methyl]phenyl}-1,3,5-triazin-2-amine
TypeSmall organic molecule
Emp. Form.C24H21F2N5O2S
Mol. Mass.481.518
SMILESCS(=N)(=O)Cc1cccc(Nc2ncnc(n2)-c2ccc(F)cc2OCc2cccc(F)c2)c1