Reaction Details
TargetAcetylcholinesterase
LigandBDBM10630
Substrate/CompetitorBDBM8959
Meas. Tech.Enzyme Inhibition Assay
pH7.5±n/a
Temperature298.15±n/a K
Ki 700±400 nM
Citation Bar-On, PMillard, CBHarel, MDvir, HEnz, ASussman, JLSilman, I Kinetic and structural studies on the interaction of cholinesterases with the anti-Alzheimer drug rivastigmine. Biochemistry41:3555-64 (2002) 
 
Acetylcholinesterase
Name:Acetylcholinesterase
Type:n/a
Mol. Mass.:65900.74
Organism:Tetronarce californica (Pacific electric ray) (Torpedo californica)
Description:P04058
Residue:586
BDBM10630
BDBM8959
NameBDBM10630
Synonyms:3-[1-(dimethylamino)ethyl]phenol | NAP
TypeSmall organic molecule
Emp. Form.C10H15NO
Mol. Mass.165.2322
SMILESCC(N(C)C)c1cccc(O)c1