Reaction Details
TargetBDNF/NT-3 growth factors receptor
LigandBDBM164885
Substrate/Competitorn/a
Meas. Tech.TrkB Activity
IC50 0.500±n/a nM
Citation Kane, Jr., JLMatthews, GMetz, MKothe, MLiu, JScholte, A Tropomyosin-related kinase (TRK) inhibitors US Patent US9611265 Publication Date 4/4/2017
 
BDNF/NT-3 growth factors receptor
Name:BDNF/NT-3 growth factors receptor
Type:Enzyme
Mol. Mass.:91996.87
Organism:Homo sapiens (Human)
Description:Q16620
Residue:822
BDBM164885
NameBDBM164885
Synonyms:US10166239, Ex. 3-1 US9067914, Ex. 3-1
TypeSmall organic molecule
Emp. Form.C27H27N5O3
Mol. Mass.469.535
SMILESCOc1ccc(COc2ccc(Cn3c(N)nc4cc(ccc34)-c3cnn(C)c3)cc2OC)cc1