Reaction Details
TargetNT-3 growth factor receptor
LigandBDBM164901
Substrate/Competitorn/a
Meas. Tech.TrkC Activity
IC50 0.503±n/a nM
Citation Kane, Jr., JLMatthews, GMetz, MKothe, MLiu, JScholte, A Tropomyosin-related kinase (TRK) inhibitors US Patent US9611265 Publication Date 4/4/2017
 
NT-3 growth factor receptor
Name:NT-3 growth factor receptor
Type:Enzyme
Mol. Mass.:94428.15
Organism:Homo sapiens (Human)
Description:Q16288
Residue:839
BDBM164901
NameBDBM164901
Synonyms:US10166239, Ex. 3-15 US9067914, Ex. 3-15
TypeSmall organic molecule
Emp. Form.C26H26N6O3
Mol. Mass.470.523
SMILESCOc1ccc(COc2ccc(Cn3c(N)nc4cc(cnc34)-c3cnn(C)c3)cc2OC)cc1